Ask Your Question

aka's profile - activity

2019-01-08 10:03:28 -0500 received badge  Famous Question (source)
2018-10-26 06:32:34 -0500 received badge  Notable Question (source)
2018-09-13 03:44:13 -0500 received badge  Popular Question (source)
2018-06-25 12:46:03 -0500 received badge  Enthusiast
2018-06-24 19:14:35 -0500 asked a question failed to deploy Openstack when AllNodesDeploySteps resource

I am trying to install Ocata openstack ( everything is VM) using tripleo, I have got the below error in deployment phase.


openstack overcloud deploy --templates --compute-scale 1 --compute-flavor compute --control-scale 1 --control-flavor control --ntp-server http://pool.ntp.org --libvirt-type qemu

from director vm:

2018-06-15 16:52:36Z [overcloud.AllNodesDeploySteps.ControllerDeployment_Step1.0]: SIGNAL_IN_PROGRESS Signal: deployment 75c07b9b-1827-4fea-8dfb-6560088ed2e4 failed (1) 2018-06-15 16:52:37Z [overcloud.AllNodesDeploySteps.ControllerDeployment_Step1.0]: CREATE_FAILED Error: resources[0]: Deployment to server failed: deploy_status_code : Deployment exited with non-zero status code: 1 2018-06-15 16:52:38Z [overcloud.AllNodesDeploySteps.ControllerDeployment_Step1]: CREATE_FAILED Resource CREATE failed: Error: resources[0]: Deployment to server failed: deploy_status_code : Deployment exited with non-zero status code: 1

from controller instance:

Jun 15 16:52:32 overcloud-controller-0 os-collect-config: [2018-06-15 16:52:32,299] (heat-config) [INFO] Notice: hiera(): Cannot load backend module_data: cannot load such file - - hiera/backend/module_data_backend Jun 15 16:52:32 overcloud-controller-0 os-collect-config: [2018-06-15 16:52:32,300] (heat-config) [INFO] Error: Evaluation Error: Error while evaluating a Function Call, Could no t find data item oslo_messaging_rpc_password in any Hiera data file and no default supplied at /etc/puppet/modules/tripleo/manifests/profile/base/cinder.pp:87:30 on node overclou d-controller-0.localdomain Jun 15 16:52:32 overcloud-controller-0 os-collect-config: [2018-06-15 16:52:32,300] (heat-config) [ERROR] Error running /var/lib/heat-config/heat-config-puppet/764c6653-ebb7-44e7 -8dd7-eb0d210e85c2.pp. [1]

from compute instance:

Jun 15 16:52:44 overcloud-novacompute-0 os-collect-config: (at /etc/puppet/modules/stdlib/lib/puppet/functions/deprecation.rb:28:in `deprecation') Jun 15 16:52:44 overcloud-novacompute-0 os-collect-config: Error: Evaluation Error: Error while evaluating a Function Call, Could not find data item oslo_messaging_rpc_password i n any Hiera data file and no default supplied at /etc/puppet/modules/tripleo/manifests/profile/base/neutron.pp:94:30 on node overcloud-novacompute-0.localdomain Jun 15 16:52:44 overcloud-novacompute-0 os-collect-config: [2018-06-15 16:52:43,992] (heat-config) [ERROR] Error running /var/lib/heat-config/heat-config-puppet/a9abdb8a-fabc-4e2 8-8ec1-e737c6aba218.pp. [1] Jun 15 16:52:44 overcloud-novacompute-0 os-collect-config: [2018-06-15 16:52:43,997] (heat-config) [INFO] Completed /usr/libexec/heat-config/hooks/puppet Jun 15 16:52:44 overcloud-novacompute-0 os-collect-config: [2018-06-15 16:52:43,998] (heat-config) [DEBUG] Running heat-config-notify /var/lib/heat-config/deployed/a9abdb8a-fabc-

I am new to Openstack and puppet can you please help?