stackattack's profile - activity

2017-07-26 07:52:00 -0600 received badge  Famous Question (source)
2017-07-26 07:52:00 -0600 received badge  Notable Question (source)
2017-07-26 07:52:00 -0600 received badge  Popular Question (source)
2017-07-20 11:54:41 -0600 commented question [SOLVED] How to solve InternalServerError: Internal Server Error (HTTP 500) on first project creation following Ocata rdo guide?

Thanks Bernd. This is the page I completed without errors right before getting the error I posted. It occurs to me that unless I"m missing something major, the docs don't work straight through. Can you recommend logs to examine for a clue? Thanks.

2017-07-19 11:01:50 -0600 commented question [SOLVED] How to solve InternalServerError: Internal Server Error (HTTP 500) on first project creation following Ocata rdo guide?

Well, that document page is actually 2 pages later. Are they out of sequence?

2017-07-18 03:29:41 -0600 received badge  Famous Question (source)
2017-07-17 18:41:01 -0600 commented question [SOLVED] How to solve InternalServerError: Internal Server Error (HTTP 500) on first project creation following Ocata rdo guide?

Yes, in fact all of my openstack commands return this error: Missing value auth-url required for auth plugin password. I wonder if the database is amiss.

2017-07-17 18:39:28 -0600 commented question [SOLVED] How to solve InternalServerError: Internal Server Error (HTTP 500) on first project creation following Ocata rdo guide?

I'm getting the same thing following the standard docs here: docs.openstack.org/ocata/install-guide-rdo/keystone-users

openstack project create --domain default --description "Service Project" service --debug OpenStackConfigException: Missing value auth-url required for auth plugin password ..

2017-04-25 02:30:36 -0600 received badge  Popular Question (source)
2017-04-25 02:30:36 -0600 received badge  Famous Question (source)
2017-04-25 02:30:36 -0600 received badge  Notable Question (source)
2017-04-20 14:55:50 -0600 received badge  Famous Question (source)
2017-04-17 23:12:31 -0600 commented question packstack Ocata --allinone error:

Things still appear to be time related: Apr 17 21:11:22 c7m2 systemd: Started OpenStack Nova Cert Server. Apr 17 21:11:26 c7m2 systemd: openstack-nova-cert.service holdoff time over, scheduling restart. Apr 17 21:11:26 c7m2 systemd: Starting OpenStack Nova Cert Server... ...recurring

2017-04-17 22:15:29 -0600 commented question packstack Ocata --allinone error:

[root@c7m2 ~]# ps -ef |grep nova-scheduler nova 36960 1 16 20:14 ? 00:00:03 /usr/bin/python2 /usr/bin/nova-scheduler root 37021 36346 0 20:15 pts/0 00:00:00 grep --color=auto nova-scheduler

2017-04-17 22:12:07 -0600 commented question packstack Ocata --allinone error:

Anyone have any thoughts? It's always issues surrounding Nova Scheduler. This last iteration - I'm making this controller node into an NTP server first in case its time related. ANY ADVICE?

2017-04-14 12:54:31 -0600 commented question packstack Ocata --allinone error:

Is it necessary to install NTP server service prior to running packstack?

2017-04-14 12:53:06 -0600 commented question packstack Ocata --allinone error:

Apr 14 10:51:30 http://c7m2.lab.siliconmechanics.com systemd[1]: openstack-nova-scheduler.service holdoff time over, scheduling restart. Apr 14 10:51:30 http://c7m2.lab.siliconmechanics.com systemd[1]: Starting OpenStack Nova Scheduler Server...

2017-04-14 12:52:59 -0600 commented question packstack Ocata --allinone error:

[root@c7m2 ~]# systemctl status openstack-nova-scheduler -l ‚óŹ openstack-nova-scheduler.service - OpenStack Nova Scheduler Server Loaded: loaded (/usr/lib/systemd/system/openstack-nova-scheduler.service; disabled; vendor preset: disabled) Active: activating (start) since Fri 2017-04-14 ...

2017-04-14 12:52:16 -0600 commented question packstack Ocata --allinone error:

Thanks. ntpd is not running. there is no "CONFIG_NTP_SERVERS" block in my answer file.

2017-04-12 20:39:39 -0600 received badge  Notable Question (source)
2017-04-12 16:58:55 -0600 commented question packstack Ocata --allinone error:

Another iteration. tail /var/log/messages

Failed to start OpenStack Nova Scheduler Server.
2017-04-12 11:26:16 -0600 commented question packstack Ocata --allinone error:

ERROR : Error appeared during Puppet run: 10.101.23.50_controller.pp Error: /usr/sbin/ntpdate 10.101.23.30 returned 1 instead of one of [0] Do I need to setup NTP server locally prior prior to running? I thought packstack did that.

2017-04-12 11:20:39 -0600 commented question packstack Ocata --allinone error:

I reran after fixing DATE/TIME and have new errors.

... Discovering ip protocol version [ DONE ] ... Installing time synchronization via NTP [ DONE ] ... 10.101.23.50_controller.pp: [ ERROR ] Applying Puppet manifests [ ERROR ]

2017-04-11 23:41:31 -0600 received badge  Popular Question (source)
2017-04-11 10:53:12 -0600 commented question packstack Ocata --allinone error:

I think it's NTP related. That was the first thing to fail.

2017-04-11 10:52:50 -0600 commented question packstack Ocata --allinone error:

Hi Rajesh. Thank you. I don't believeI can attach many lines here. I grepped for "fail".

Error: /Stage[main]/Packstack::Chrony/Exec[ntpdate]/returns: change from notrun to 0 failed: /usr/sbin/ntpdate 10.101.23.30 returned 1 instead of one of [0]

Notice: /Stage[main]/Packstack::Chrony/Service[

2017-04-11 10:48:48 -0600 answered a question packstack Ocata --allinone error:

Hi Rajesh. Here we go. Thank you. running' Notice: /Stage[main]/Nova::Conductor/Nova::Generic_service[conductor]/Service[nova-conductor]/ensure: ensure changed 'stopped' to 'running' Error: Systemd start for openstack-nova-scheduler failed! journalctl log for openstack-nova-scheduler: -- Logs begin at Fri 2017-04-07 14:26:25 EDT, end at Fri 2017-04-07 16:31:37 EDT. -- Apr 07 16:31:03 c7m2 systemd[1]: Starting OpenStack Nova Scheduler Server... Apr 07 16:31:37 c7m2 systemd[1]: openstack-nova-scheduler.service: main process exited, code=exited, status=1/FAILURE Apr 07 16:31:37 c7m2 systemd[1]: Failed to start OpenStack Nova Scheduler Server. Apr 07 16:31:37 c7m2 systemd[1]: Unit openstack-nova-scheduler.service entered failed state. Apr 07 16:31:37 c7m2 systemd[1]: openstack-nova-scheduler.service failed.

Error: /Stage[main]/Nova::Scheduler/Nova::Generic_service[scheduler]/Service[nova-scheduler]/ensure: change from stopped to running failed: Systemd start for openstack-nova-scheduler failed! journalctl log for openstack-nova-scheduler: -- Logs begin at Fri 2017-04-07 14:26:25 EDT, end at Fri 2017-04-07 16:31:37 EDT. -- Apr 07 16:31:03 c7m2 systemd[1]: Starting OpenStack Nova Scheduler Server... Apr 07 16:31:37 c7m2 systemd[1]: openstack-nova-scheduler.service: main process exited, code=exited, status=1/FAILURE Apr 07 16:31:37 c7m2 systemd[1]: Failed to start OpenStack Nova Scheduler Server. Apr 07 16:31:37 c7m2 systemd[1]: Unit openstack-nova-scheduler.service entered failed state. Apr 07 16:31:37 c7m2 systemd[1]: openstack-nova-scheduler.service failed.

Notice: /Stage[main]/Nova::Scheduler/Nova::Generic_service[scheduler]/Service[nova-scheduler]: Triggered 'refresh' from 1 events Notice: /Stage[main]/Nova::Vncproxy/Nova::Generic_service[vncproxy]/Service[nova-vncproxy]/ensure: ensure changed 'stopped' to 'running' Notice: /Stage[main]/Nova::Consoleauth/Nova::Generic_service[consoleauth]/Service[nova-consoleauth]/ensure: ensure changed 'stopped' to 'running' Notice: /Stage[main]/Nova::Deps/Anchor[nova::service::end]: Dependency Service[nova-scheduler] has failures: true Warning: /Stage[main]/Nova::Deps/Anchor[nova::service::end]: Skipping because of failed dependencies Notice: /Stage[main]/Nova::Cell_v2::Discover_hosts/Exec[nova-cell_v2-discover_hosts]: Dependency Service[nova-scheduler] has failures: true Warning: /Stage[main]/Nova::Cell_v2::Discover_hosts/Exec[nova-cell_v2-discover_hosts]: Skipping because of failed dependencies Notice: /Stage[main]/Apache/Apache::Vhost[default]/Concat[15-default.conf]/File[/etc/httpd/conf.d/15-default.conf]/ensure: defined content as '{md5}a430bf4e003be964b419e7aea251c6c4' Notice: /Stage[main]/Keystone::Wsgi::Apache/Apache::Vhost[keystone_wsgi_main]/Concat[10-keystone_wsgi_main.conf]/File[/etc/httpd/conf.d/10-keystone_wsgi_main.conf]/ensure: defined content as '{md5}41ef3760c61b6373fdb7786e650547eb' Notice: /Stage[main]/Keystone::Wsgi::Apache/Apache::Vhost[keystone_wsgi_admin]/Concat[10-keystone_wsgi_admin.conf]/File[/etc/httpd/conf.d/10-keystone_wsgi_admin.conf]/ensure: defined content as '{md5}3b53843aca8b2c60b450c6f40770a6a6' Notice: /Stage[main]/Horizon::Wsgi::Apache/Apache::Vhost[horizon_vhost]/Concat[15-horizon_vhost.conf]/File[/etc/httpd/conf.d/15-horizon_vhost.conf]/ensure: defined content as '{md5}be8f58a3659d3201f8464437a1f17424' Notice: /Stage[main]/Nova::Wsgi::Apache_placement/Openstacklib::Wsgi::Apache[placement_wsgi]/Apache::Vhost[placement_wsgi]/Concat[10-placement_wsgi.conf]/File[/etc/httpd/conf.d/10-placement_wsgi.conf]/ensure: defined content as '{md5}7de29463ca522460ba3193efff2198c1' Notice: /Stage[main]/Apache/Concat[/etc/httpd/conf/ports.conf]/File[/etc/httpd/conf/ports.conf]/ensure: defined content as '{md5}d548920a8ce8b1560e58e60fde2d39a9' Notice: /Stage[main]/Apache/File[/etc/httpd/conf/httpd.conf]/content: content ... (more)

2017-04-10 13:04:10 -0600 asked a question packstack Ocata --allinone error:

I receive this error when running allinone on a fresh minimal install CentOS Linux release 7.3.1611 (Core) I'm following this doc step-by-step: https://www.rdoproject.org/install/quickstart/ (https://www.rdoproject.org/install/qu...) The error occurs after step 3: "packstack --allinone"

* "Error: Failed to apply catalog" *

tail -f /var/tmp/packstack/20170407-160121-81CAUG/openstack-setup.log

PuppetError: Error appeared during Puppet run: 10.101.23.50_controller.pp Error: /usr/sbin/ntpdate 10.101.23.30 returned 1 instead of one of [0] You will find full trace in log /var/tmp/packstack/20170407-160121-81CAUG/manifests/10.101.23.50_controller.pp.log  

2017-04-07 17:09:08::INFO::shell::94::root:: [10.101.23.50] Executing script: rm -rf /var/tmp/packstack/832b7dfb937b46c5b24c337850e0cc6f

tail /var/tmp/packstack/20170407-160121-81CAUG/manifests/10.101.23.50_controller.pp.log

Error: Failed to apply catalog: Command: 'openstack ["flavor", "list", "--quiet", "--format", "csv", ["--long", "--all"]]' has been running for more than 40 seconds (tried 4, for a total of 170 seconds)
2017-04-10 12:45:18 -0600 commented answer Packstack Ocata allinone error: "Could not find declared class ::nova::db::mysql_placement"

Hi folks. No - I do only fresh installs of CentOS 7.x minimal. No older/other packages. I've never gotten this part of the install to actually complete. I've run through the doc step by step to no avail.

2017-04-04 21:10:43 -0600 commented answer Error when installing Ocata Packstack on CentOS 7.3.1611

16GB MEM- same thing

2017-04-04 17:29:46 -0600 received badge  Commentator
2017-04-04 17:29:46 -0600 commented answer Packstack Ocata allinone error: "Could not find declared class ::nova::db::mysql_placement"

So Packstack Ocata does NOT work as-is? Is this correct?

2017-04-04 17:24:25 -0600 commented answer Error when installing Ocata Packstack on CentOS 7.3.1611

Additionally, Horizon does finally load at http://my_ip/dashboard however, neither admin nor demo credentials ever load the next page. It hovers at the login page. The only log entry in the horizon log file indicates a success.

2017-04-04 17:22:48 -0600 commented answer Error when installing Ocata Packstack on CentOS 7.3.1611

I'm receiving the same result after doubling my RAM to 4GB on the deployment node. running top during the install reveals more than 1GB available RAM. Thoughts?

Testing if puppet apply is finished: 10.101.23.63_controller.pp [ \ ] 10.101.23.63_controller.pp: [ ERROR ]

2017-03-23 12:50:19 -0600 asked a question When running sudo lxd init I get the following error:

I'm installing JuJu on my MAAS server with LXD via standard juju web site process. This is Ubuntu 16.04 and MAAS 2.1x MAAS is fully configured and working for deployment.

"add-apt-repository -u ppa:juju/stable apt install juju lxd zfsutils-linux juju --version 2.1.2-xenial-amd64 newgrp lxd groups lxd root juju bootstrap localhost lxd-test juju status ERROR No model in focus. sudo lxd init error: Unable to talk to LXD: Get http://unix.socket/1.0: dial unix /var/lib/lxd/unix.socket: connect: connection refused"

2017-02-24 10:51:58 -0600 received badge  Enthusiast
2017-02-23 19:58:38 -0600 commented question "openstack network agent list" results in HttpException: Internal Server Error

Sorry - forgot to menton I now get 2 agents listed.

Agent Type

DHCP agent
Metadata agent

2017-02-23 19:55:45 -0600 commented question "openstack network agent list" results in HttpException: Internal Server Error

< only 3 log files exist for neutron > root@control1:/var/log/neutron# ls -alt -rw-r--r-- neutron neutron neutron-metadata-agent.log -rw-r--r-- neutron neutron neutron-dhcp-agent.log -rw-r--r-- neutron neutron neutron-server.log

2017-02-23 19:52:03 -0600 commented question "openstack network agent list" results in HttpException: Internal Server Error

cat neutron-metadata-agent.log

(all INFO)

cat neutron-dhcp-agent.log

(THIS ONE IS LITERALLY ALL ERRORS]

2017-02-23 19:49:18 -0600 commented question "openstack network agent list" results in HttpException: Internal Server Error

tail 50 neutron-server.log

ERROR neutron.api.extensions [-] Unable to process extensions (auto-allocated-topology) because the configured plugins do not satisfy their requirements. Some features will not work as expected.

cat neutron-linuxbridge-agent.log

(no entries)

2017-02-22 15:30:20 -0600 received badge  Editor (source)
2017-02-22 15:29:37 -0600 asked a question "openstack network agent list" results in HttpException: Internal Server Error

Following the docs for Ubuntu and stuck here: docs.openstack.org/newton/install-guide-ubuntu/neutron-verify-option1

Error: HttpException: Internal Server Error

Any thoughts?

2017-02-13 11:32:34 -0600 commented answer 10485 WARNING keystone.assignment.core [-] Deprecated:

Empty set (0.00 sec). I see it now. Sync produces: oslo_db.sqlalchemy.engines [-] SQL connection failed. 10 attempts left

2017-02-10 16:24:06 -0600 received badge  Notable Question (source)
2017-02-10 11:29:32 -0600 commented answer 10485 WARNING keystone.assignment.core [-] Deprecated:

...VALUES (?, ?, ?, ?, ?, ?, ?, ?)'] [parameters: ('default', 'Default', '<<keystone.domain.root>>', 'The default domain', 1, '{}', None, 1)] 2017-02-10 09:07:12.572 27107 ERROR keystone

2017-02-10 11:28:55 -0600 commented answer 10485 WARNING keystone.assignment.core [-] Deprecated:

Apologies, it actually ends with a keystone error: 2017-02-10 09:07:12.572 27107 ERROR keystone DBNonExistentTable: (sqlite3.OperationalError) no such table: project [SQL: u'INSERT INTO project (id, name, domain_id, description, enabled, extra, parent_id, is_domain) continued...