Ask Your Question

prateeka's profile - activity

2017-05-17 06:56:51 -0500 received badge  Popular Question (source)
2017-05-17 06:56:51 -0500 received badge  Notable Question (source)
2017-02-28 04:50:40 -0500 received badge  Notable Question (source)
2017-02-16 03:27:07 -0500 received badge  Popular Question (source)
2017-01-10 06:07:36 -0500 received badge  Famous Question (source)
2016-12-06 04:59:36 -0500 received badge  Famous Question (source)
2016-12-06 04:58:31 -0500 received badge  Notable Question (source)
2016-11-18 00:47:14 -0500 received badge  Famous Question (source)
2016-09-28 00:56:46 -0500 received badge  Notable Question (source)
2016-09-22 14:23:40 -0500 received badge  Popular Question (source)
2016-09-20 04:59:30 -0500 commented question Issues with ovs-dpdk + devstack

Hi, I am also facing the same issue. Any leads on this?

2016-09-20 04:57:59 -0500 commented answer how does nova decide the VM nic type?

Hi, did you try launching instance using ovs-dpdk? My instances are not getting ip and neutron=dhcp service is failing.

2016-09-20 04:53:42 -0500 asked a question instance not getting ip with vhu interface

Hi, I am trying to launch instance using ovs-dpdk in openstack. But the vm is not getting ip address, neutron dhcp agent is failing.

neutron-server log is below:

<163>Sep 20 08:18:35 node-41 neutron-dhcp-agent: 2016-09-20 08:18:35.283 11040 ERROR neutron.agent.linux.utils [req-99d8215a-a0f4-4776-842f-b984248cf55c 435d7f0a3b844151bd4f9d32620b7b62 50a5a662cd454256a543e3056c4a5a4e - - -] Exit code: 2; Stdin: ; Stdout: ; Stderr:
dnsmasq: unknown interface None
<163>Sep 20 08:18:35 node-41 neutron-dhcp-agent: 2016-09-20 08:18:35.283 11040 ERROR neutron.agent.dhcp.agent [req-99d8215a-a0f4-4776-842f-b984248cf55c 435d7f0a3b844151bd4f9d32620b7b62 50a5a662cd454256a543e3056c4a5a4e - - -] Unable to reload_allocations dhcp for bfc9a8ee-9bce-43ca-902b-e546524824ef.
2016-09-20 08:18:35.283 11040 ERROR neutron.agent.dhcp.agent Traceback (most recent call last):
2016-09-20 08:18:35.283 11040 ERROR neutron.agent.dhcp.agent   File "/usr/lib/python2.7/dist-packages/neutron/agent/dhcp/agent.py", line 112, in call_driver
2016-09-20 08:18:35.283 11040 ERROR neutron.agent.dhcp.agent     getattr(driver, action)(**action_kwargs)
2016-09-20 08:18:35.283 11040 ERROR neutron.agent.dhcp.agent   File "/usr/lib/python2.7/dist-packages/neutron/agent/linux/dhcp.py", line 473, in reload_allocations
2016-09-20 08:18:35.283 11040 ERROR neutron.agent.dhcp.agent     self._spawn_or_reload_process(reload_with_HUP=True)
2016-09-20 08:18:35.283 11040 ERROR neutron.agent.dhcp.agent   File "/usr/lib/python2.7/dist-packages/neutron/agent/linux/dhcp.py", line 438, in _spawn_or_reload_process
2016-09-20 08:18:35.283 11040 ERROR neutron.agent.dhcp.agent     pm.enable(reload_cfg=reload_with_HUP)
2016-09-20 08:18:35.283 11040 ERROR neutron.agent.dhcp.agent   File "/usr/lib/python2.7/dist-packages/neutron/agent/linux/external_process.py", line 92, in enable
2016-09-20 08:18:35.283 11040 ERROR neutron.agent.dhcp.agent     run_as_root=self.run_as_root)
2016-09-20 08:18:35.283 11040 ERROR neutron.agent.dhcp.agent   File "/usr/lib/python2.7/dist-packages/neutron/agent/linux/ip_lib.py", line 927, in execute
2016-09-20 08:18:35.283 11040 ERROR neutron.agent.dhcp.agent     log_fail_as_error=log_fail_as_error, **kwargs)
2016-09-20 08:18:35.283 11040 ERROR neutron.agent.dhcp.agent   File "/usr/lib/python2.7/dist-packages/neutron/agent/linux/utils.py", line 140, in execute
2016-09-20 08:18:35.283 11040 ERROR neutron.agent.dhcp.agent     raise RuntimeError(msg)
2016-09-20 08:18:35.283 11040 ERROR neutron.agent.dhcp.agent RuntimeError:
<166>Sep 20 08:18:35 node-41 neutron-dhcp-agent: 2016-09-20 08:18:35.755 16911 INFO neutron.agent.dhcp.agent [-] Finished network bfc9a8ee-9bce-43ca-902b-e546524824ef dhcp configuration
<166>Sep 20 08:18:35 node-41 neutron-dhcp-agent: 2016-09-20 08:18:35.755 16911 INFO neutron.agent.dhcp.agent [-] Synchronizing state complete
<166>Sep 20 08:18:35 node-41 neutron-openvswitch-agent: 2016-09-20 08:18:35.801 25357 INFO neutron.agent.common.ovs_lib [req-2f137dfc-f109-4eac-8fb4-5fcb905ed60b - - - - -] Port 32fcc25c-090e-4f50-9e3e-84fdb1aac901 not present in bridge br-int
<166>Sep 20 08:18:35 node-41 neutron-openvswitch-agent: 2016-09-20 08:18:35.802 25357 INFO neutron.plugins.ml2.drivers.openvswitch.agent.ovs_neutron_agent [req-2f137dfc-f109-4eac-8fb4-5fcb905ed60b - - - - -] port_unbound(): net_uuid None not in local_vlan_map
<166>Sep 20 08:18:35 node-41 neutron-openvswitch-agent: 2016-09-20 08:18:35.802 25357 INFO neutron.agent.securitygroups_rpc [req-2f137dfc-f109-4eac-8fb4-5fcb905ed60b - - - - -] Remove device filter for [u'32fcc25c-090e-4f50-9e3e-84fdb1aac901']
2016-08-17 08:06:58 -0500 received badge  Popular Question (source)
2016-08-03 02:11:29 -0500 asked a question using get_file within tosca template

Hi, I am trying to pass a script from tosca template using user_data field.Here is my template:

vdus: vdu1: id: vdu1 vm_image: TestVM instance_type: m1.micro service_type: firewall

network_interfaces:
  management:
    network: mgmt_net
    management: true

placement_policy:
  availability_zone: nova

auto-scaling: noop
monitoring_policy: noop
failure_policy: respawn

user_data_format: RAW
user_data: |
 get_file: try.sh

VNF is getting spawned but script is not executing. What is the way to pass a script from tosca-template?

2016-08-02 10:14:18 -0500 received badge  Famous Question (source)
2016-08-01 12:48:11 -0500 received badge  Notable Question (source)
2016-07-31 04:56:24 -0500 received badge  Popular Question (source)
2016-07-14 05:55:16 -0500 received badge  Popular Question (source)
2016-07-13 03:34:25 -0500 asked a question unable to ping VNF

Hi, I have created 2 VNF's using tacker on my setup. But I am not able to ping those VNF's neither able to do a ssh to them. What could be the possible problem here?

root@pro:~# tacker vnf-list +--------------------------------------+----------+-------------------+---------------------------+--------+ | id | name | description | mgmt_url | status | +--------------------------------------+----------+-------------------+---------------------------+--------+ | 23e1e0a1-360c-4754-bc9b-ea684f98ba38 | testVNF1 | firewall1-example | {"vdu1": "192.168.111.6"} | ACTIVE | | 42407c2c-78d2-4929-b456-0e277a1ecaa1 | tVNF | firewall1-example | {"vdu1": "192.168.111.8"} | ACTIVE | | b391d3b0-ae75-4bed-8395-a88cba30438f | testVNF2 | firewall2-example | {"vdu1": "192.168.111.7"} | ACTIVE | +--------------------------------------+----------+-------------------+---------------------------+--------+

2016-07-12 01:04:26 -0500 asked a question Error: Invalid service catalog service: nfv-orchestration

I have installed tacker and tacker-horizon in my openstack setup. VNF launching is also successful, but while logging into tacker-horizon and clicking on VNF Manger it is throwing the error Invalid service catalog service: nfv-orchestration Can somebody help?

2016-06-22 01:29:31 -0500 commented answer cannot launch new vnf

Also found this error in neutron-server.log:

ProgrammingError: (_mysql_exceptions.ProgrammingError) (1146, "Table 'neutron.ml2_vlan_allocations' doesn't exist") [SQL: u'SELECT ml2_vlan_allocations.physical_network AS ml2_vlan_allocations_physical_network, ml2_vlan_allocations.vlan_id AS ml2_vlan_al

2016-06-22 01:28:33 -0500 received badge  Notable Question (source)
2016-06-22 01:28:30 -0500 received badge  Enthusiast
2016-06-21 01:51:32 -0500 received badge  Popular Question (source)
2016-06-21 00:44:07 -0500 commented answer cannot launch new vnf

Heat service is running and stack creation is also going on fine.

+--------------------------------------+------------+-----------------+---------------------+--------------+ | id | stack_name | stack_status | creation_time | updated_time | +--------------

2016-06-20 05:11:22 -0500 asked a question cannot launch new vnf

I've created a VNFD but I am getting the following erreor when I try to launch new VNF:

2016-06-20 10:02:20.514 11269 ERROR root [-] Original exception being dropped: ['Traceback (most recent call last):\n', '  File "/usr/lib/python2.7/dist-packages/tacker/vm/plugin.py", line 298, in _create_device\n    context=context, device=device_dict)\n', '  File "/usr/lib/python2.7/dist-packages/tacker/common/driver_manager.py", line 75, in invoke\n    return getattr(driver, method_name)(**kwargs)\n', '  File "/usr/lib/python2.7/dist-packages/tacker/common/log.py", line 34, in wrapper\n    return method(*args, **kwargs)\n', '  File "/usr/lib/python2.7/dist-packages/tacker/vm/drivers/heat/heat.py", line 258, in create\n    template_dict)\n', '  File "/usr/lib/python2.7/dist-packages/tacker/common/log.py", line 34, in wrapper\n    return method(*args, **kwargs)\n', '  File "/usr/lib/python2.7/dist-packages/tacker/vm/drivers/heat/heat.py", line 191, in _process_vdu_network_interfaces\n    if network_param.pop(\'management\', False):\n', "AttributeError: 'str' object has no attribute 'pop'\n"]
2016-06-20 10:02:20.514 11269 ERROR tacker.api.v1.resource [req-8637df38-bc28-40aa-bd6b-6a69a0d61f71 None] create failed
2016-06-20 10:02:20.514 11269 TRACE tacker.api.v1.resource Traceback (most recent call last):
2016-06-20 10:02:20.514 11269 TRACE tacker.api.v1.resource   File "/usr/lib/python2.7/dist-packages/tacker/api/v1/resource.py", line 87, in resource
2016-06-20 10:02:20.514 11269 TRACE tacker.api.v1.resource     result = method(request=request, **args)
2016-06-20 10:02:20.514 11269 TRACE tacker.api.v1.resource   File "/usr/lib/python2.7/dist-packages/tacker/api/v1/base.py", line 398, in create
2016-06-20 10:02:20.514 11269 TRACE tacker.api.v1.resource     obj = obj_creator(request.context, **kwargs)
2016-06-20 10:02:20.514 11269 TRACE tacker.api.v1.resource   File "/usr/lib/python2.7/dist-packages/tacker/vm/plugin.py", line 665, in create_vnf
2016-06-20 10:02:20.514 11269 TRACE tacker.api.v1.resource     vnf_dict = self.create_device(context, vnf)
2016-06-20 10:02:20.514 11269 TRACE tacker.api.v1.resource   File "/usr/lib/python2.7/dist-packages/tacker/vm/plugin.py", line 312, in create_device
2016-06-20 10:02:20.514 11269 TRACE tacker.api.v1.resource     device_dict = self._create_device(context, device)
2016-06-20 10:02:20.514 11269 TRACE tacker.api.v1.resource   File "/usr/lib/python2.7/dist-packages/tacker/vm/plugin.py", line 301, in _create_device
2016-06-20 10:02:20.514 11269 TRACE tacker.api.v1.resource     self.delete_device(context, device_id)
2016-06-20 10:02:20.514 11269 TRACE tacker.api.v1.resource   File "/usr/lib/python2.7/dist-packages/tacker/vm/plugin.py", line 408, in delete_device
2016-06-20 10:02:20.514 11269 TRACE tacker.api.v1.resource     self._delete_device_post(context, device_id, e)
2016-06-20 10:02:20.514 11269 TRACE tacker.api.v1.resource   File "/usr/lib/python2.7/dist-packages/tacker/openstack/common/excutils.py", line 82, in __exit__
2016-06-20 10:02:20.514 11269 TRACE tacker.api.v1.resource     six.reraise(self.type_, self.value, self.tb)
2016-06-20 10:02:20.514 11269 TRACE tacker.api ...
(more)
2016-06-08 07:58:15 -0500 asked a question Tacker server start failing with error

I am installing tacker with the help of a script which uses puppet. I am getting following error while starting the tacker server:

^[[mNotice: /Stage[main]/Tacker/File[/etc/tacker]/group: group changed 'root' to 'tacker'^[[0m
^[[mNotice: /Stage[main]/Tacker/File[/etc/tacker]/mode: mode changed '0755' to '0750'^[[0m
^[[mNotice: /Stage[main]/Tacker/File[/etc/tacker/tacker.conf]/owner: owner changed 'root' to 'tacker'^[[0m
^[[mNotice: /Stage[main]/Tacker/File[/etc/tacker/tacker.conf]/group: group changed 'root' to 'tacker'^[[0m
^[[mNotice: /Stage[main]/Tacker/File[/etc/tacker/tacker.conf]/mode: mode changed '0644' to '0600'^[[0m
^[[mNotice: /Stage[main]/Tacker/Tacker_config[keystone_authtoken/auth_url]/value: value changed 'http://127.0.0.1:35357' to 'http://192.168.0.2:35357/'^[[0m
^[[1;31mError: /Stage[main]/Tacker::Service/Service[tacker]: Could not evaluate: Could not find init script or upstart conf file for 'tacker'^[[0m
^[[1;31mError: /Stage[main]/Tacker::Service/Service[tacker]: Failed to call refresh: Could not find init script or upstart conf file for 'tacker'^[[0m
^[[1;31mError: /Stage[main]/Tacker::Service/Service[tacker]: Could not find init script or upstart conf file for 'tacker'

Anyone got this error before?

2016-06-08 00:50:32 -0500 commented answer tacker-db-manage is failing in liberty

I have used the same command and it is failing with the above mentioned error.

2016-06-07 07:32:16 -0500 commented question tacker-db-manage is failing in liberty

Hi, I am also getting the same error while populating the tacker database. Any leads on this?

2016-05-31 09:28:50 -0500 asked a question recipe for target '/build/bin/yumdownloader' failed- Fuel iso

Hi, I am trying to build fuel iso but getting this error while giving command make iso:

mkdir -p /build/bin
cp -a /usr/bin/yumdownloader /build/yumdownloader
( cd /build && patch -p0 ) < /home/mv/fuel/fuel-main/mirror/centos/yumdownloader-deps.patch
patching file yumdownloader
Hunk #2 FAILED at 208.
1 out of 2 hunks FAILED -- saving rejects to file yumdownloader.rej
/home/mv/fuel/fuel-main/mirror/centos/repo.mk:36: recipe for target '/build/bin/yumdownloader' failed
make: *** [/build/bin/yumdownloader] Error 1