Revision history [back]

click to hide/show revision 1
initial version

tempest all object storage test failing

hello

I am having a issue with running tempest on object storage. it works fine for other openstack components expect for object storage. below is the detials for my tempest.conf for object storage.

[object-storage]
catalog_type = object-store
region = xxxx
container_sync_timeout = 120
container_sync_interval = 120
accounts_quotas_available = True
container_quotas_available = True
operator_role = admin

below is the output from tempest run. i have change the endpoint url so i dont show my public url.

ks@M400005Tempest-API-Testing:~/tempest_old/tempest/Tempest_Automated_Test$ nosetests -v /home/ks/tempest_old/tempest/api/object_storage/test_object_expiry.pyc
ERROR

======================================================================
ERROR: test suite for <class 'tempest.api.object_storage.test_object_expiry.ObjectExpiryTest'>
----------------------------------------------------------------------
Traceback (most recent call last):
  File "/usr/lib/python2.7/dist-packages/nose/suite.py", line 208, in run
    self.setUp()
  File "/usr/lib/python2.7/dist-packages/nose/suite.py", line 291, in setUp
    self.setupContext(ancestor)
  File "/usr/lib/python2.7/dist-packages/nose/suite.py", line 314, in setupContext
    try_run(context, names)
  File "/usr/lib/python2.7/dist-packages/nose/util.py", line 478, in try_run
    return func()
  File "/home/ks/tempest_old/tempest/api/object_storage/test_object_expiry.py", line 33, in setUpClass
    cls.container_client.create_container(cls.container_name)
  File "/home/ks/tempest_old/tempest/services/object_storage/container_client.py", line 47, in create_container
    resp, body = self.put(url, body=None, headers=headers)
  File "/home/ks/tempest_old/tempest/common/rest_client.py", line 314, in put
    return self.request('PUT', url, headers, body)
  File "/home/ks/tempest_old/tempest/common/rest_client.py", line 436, in request
    resp, resp_body)
  File "/home/ks/tempest_old/tempest/common/rest_client.py", line 527, in _error_checker
    raise exceptions.RestClientException(str(resp.status))
RestClientException: An unknown exception occurred
Details: An unknown exception occurred
Details: 411
-------------------- >> begin captured stdout << ---------------------
self.image.client
config:<tempest.config.TempestConfig instance at 0x2e75a70>, user:ksadmin, password:AAPcloud123, auth_url:https://api.aaptest.cci.blah.com:5000/v2.0/, tenant_name:admin, auth_version:v1.0, service:image, base_url:None, region:{'compute': 'aaptest-region1', 'network': 'aaptest-region1', 'image': 'aaptest-region1', 'volume': 'aaptest-region1', 'orchestration': 'aaptest-region1', 'object-store': 'aaptest-region1', 'identity': 'aaptest-region1'}, endpoint_url:publicURL, build_interval:10, build_timeout:600
token:None...,
headers:{'Content-Type': 'application/json', 'Accept': 'application/json'}...
self.image.client_v2
config:<tempest.config.TempestConfig instance at 0x2e75a70>, user:ksadmin, password:AAPcloud123, auth_url:https://api.aaptest.cci.blah.com:5000/v2.0/, tenant_name:admin, auth_version:v1.0, service:image, base_url:None, region:{'compute': 'aaptest-region1', 'network': 'aaptest-region1', 'image': 'aaptest-region1', 'volume': 'aaptest-region1', 'orchestration': 'aaptest-region1', 'object-store': 'aaptest-region1', 'identity': 'aaptest-region1'}, endpoint_url:publicURL, build_interval:10, build_timeout:600
token:None...,
headers:{'Content-Type': 'application/json', 'Accept': 'application/json'}...
self.image.client
config:<tempest.config.TempestConfig instance at 0x2e75a70>, user:tempest_demouser_4, password:secret, auth_url:https://api.aaptest.cci.blah.com:5000/v2.0/, tenant_name:tempest_test2, auth_version:v1.0, service:image, base_url:None, region:{'compute': 'aaptest-region1', 'network': 'aaptest-region1', 'image': 'aaptest-region1', 'volume': 'aaptest-region1', 'orchestration': 'aaptest-region1', 'object-store': 'aaptest-region1', 'identity': 'aaptest-region1'}, endpoint_url:publicURL, build_interval:10, build_timeout:600
token:None...,
headers:{'Content-Type': 'application/json', 'Accept': 'application/json'}...
self.image.client_v2
config:<tempest.config.TempestConfig instance at 0x2e75a70>, user:tempest_demouser_4, password:secret, auth_url:https://api.aaptest.cci.blah.com:5000/v2.0/, tenant_name:tempest_test2, auth_version:v1.0, service:image, base_url:None, region:{'compute': 'aaptest-region1', 'network': 'aaptest-region1', 'image': 'aaptest-region1', 'volume': 'aaptest-region1', 'orchestration': 'aaptest-region1', 'object-store': 'aaptest-region1', 'identity': 'aaptest-region1'}, endpoint_url:publicURL, build_interval:10, build_timeout:600
token:None...,
headers:{'Content-Type': 'application/json', 'Accept': 'application/json'}...
self.image.client
config:<tempest.config.TempestConfig instance at 0x2e75a70>, user:ksadmin, password:AAPcloud123, auth_url:https://api.aaptest.cci.blah.com:5000/v2.0/, tenant_name:admin, auth_version:v1.0, service:image, base_url:None, region:{'compute': 'aaptest-region1', 'network': 'aaptest-region1', 'image': 'aaptest-region1', 'volume': 'aaptest-region1', 'orchestration': 'aaptest-region1', 'object-store': 'aaptest-region1', 'identity': 'aaptest-region1'}, endpoint_url:publicURL, build_interval:10, build_timeout:600
token:None...,
headers:{'Content-Type': 'application/json', 'Accept': 'application/json'}...
self.image.client_v2
config:<tempest.config.TempestConfig instance at 0x2e75a70>, user:ksadmin, password:AAPcloud123, auth_url:https://api.aaptest.cci.blah.com:5000/v2.0/, tenant_name:admin, auth_version:v1.0, service:image, base_url:None, region:{'compute': 'aaptest-region1', 'network': 'aaptest-region1', 'image': 'aaptest-region1', 'volume': 'aaptest-region1', 'orchestration': 'aaptest-region1', 'object-store': 'aaptest-region1', 'identity': 'aaptest-region1'}, endpoint_url:publicURL, build_interval:10, build_timeout:600
token:None...,
headers:{'Content-Type': 'application/json', 'Accept': 'application/json'}...
self.image.client
config:<tempest.config.TempestConfig instance at 0x2e75a70>, user:tempest_demouser_2, password:secret, auth_url:https://api.aaptest.cci.blah.com:5000/v2.0/, tenant_name:tempest_test, auth_version:v1.0, service:image, base_url:None, region:{'compute': 'aaptest-region1', 'network': 'aaptest-region1', 'image': 'aaptest-region1', 'volume': 'aaptest-region1', 'orchestration': 'aaptest-region1', 'object-store': 'aaptest-region1', 'identity': 'aaptest-region1'}, endpoint_url:publicURL, build_interval:10, build_timeout:600
token:None...,
headers:{'Content-Type': 'application/json', 'Accept': 'application/json'}...
self.image.client_v2
config:<tempest.config.TempestConfig instance at 0x2e75a70>, user:tempest_demouser_2, password:secret, auth_url:https://api.aaptest.cci.blah.com:5000/v2.0/, tenant_name:tempest_test, auth_version:v1.0, service:image, base_url:None, region:{'compute': 'aaptest-region1', 'network': 'aaptest-region1', 'image': 'aaptest-region1', 'volume': 'aaptest-region1', 'orchestration': 'aaptest-region1', 'object-store': 'aaptest-region1', 'identity': 'aaptest-region1'}, endpoint_url:publicURL, build_interval:10, build_timeout:600
token:None...,
headers:{'Content-Type': 'application/json', 'Accept': 'application/json'}...

--------------------- >> end captured stdout << ----------------------

----------------------------------------------------------------------
Ran 0 tests in 12.889s

FAILED (errors=1)
ks@M400005Tempest-API-Testing:~/tempest_old/tempest/Tempest_Automated_Test$ nosetests -v /home/ks/tempest_old/tempest/api/object_storage/test_object_services.pyc
ERROR
tempest.api.object_storage.test_object_services.PublicObjectTest.test_access_public_container_object_without_using_creds[gate,smoke] ... FAIL
tempest.api.object_storage.test_object_services.PublicObjectTest.test_access_public_object_with_another_user_creds[gate,smoke] ... FAIL

======================================================================
ERROR: test suite for <class 'tempest.api.object_storage.test_object_services.ObjectTest'>
----------------------------------------------------------------------
Traceback (most recent call last):
  File "/usr/lib/python2.7/dist-packages/nose/suite.py", line 208, in run
    self.setUp()
  File "/usr/lib/python2.7/dist-packages/nose/suite.py", line 291, in setUp
    self.setupContext(ancestor)
  File "/usr/lib/python2.7/dist-packages/nose/suite.py", line 314, in setupContext
    try_run(context, names)
  File "/usr/lib/python2.7/dist-packages/nose/util.py", line 478, in try_run
    return func()
  File "/home/ks/tempest_old/tempest/api/object_storage/test_object_services.py", line 32, in setUpClass
    cls.container_client.create_container(cls.container_name)
  File "/home/ks/tempest_old/tempest/services/object_storage/container_client.py", line 47, in create_container
    resp, body = self.put(url, body=None, headers=headers)
  File "/home/ks/tempest_old/tempest/common/rest_client.py", line 314, in put
    return self.request('PUT', url, headers, body)
  File "/home/ks/tempest_old/tempest/common/rest_client.py", line 436, in request
    resp, resp_body)
  File "/home/ks/tempest_old/tempest/common/rest_client.py", line 527, in _error_checker
    raise exceptions.RestClientException(str(resp.status))
RestClientException: An unknown exception occurred
Details: An unknown exception occurred
Details: 411
-------------------- >> begin captured stdout << ---------------------
self.image.client
config:<tempest.config.TempestConfig instance at 0x36c7cb0>, user:ksadmin, password:AAPcloud123, auth_url:https://api.aaptest.cci.blah.com:5000/v2.0/, tenant_name:admin, auth_version:v1.0, service:image, base_url:None, region:{'compute': 'aaptest-region1', 'network': 'aaptest-region1', 'image': 'aaptest-region1', 'volume': 'aaptest-region1', 'orchestration': 'aaptest-region1', 'object-store': 'aaptest-region1', 'identity': 'aaptest-region1'}, endpoint_url:publicURL, build_interval:10, build_timeout:600
token:None...,
headers:{'Content-Type': 'application/json', 'Accept': 'application/json'}...
self.image.client_v2
config:<tempest.config.TempestConfig instance at 0x36c7cb0>, user:ksadmin, password:AAPcloud123, auth_url:https://api.aaptest.cci.blah.com:5000/v2.0/, tenant_name:admin, auth_version:v1.0, service:image, base_url:None, region:{'compute': 'aaptest-region1', 'network': 'aaptest-region1', 'image': 'aaptest-region1', 'volume': 'aaptest-region1', 'orchestration': 'aaptest-region1', 'object-store': 'aaptest-region1', 'identity': 'aaptest-region1'}, endpoint_url:publicURL, build_interval:10, build_timeout:600
token:None...,
headers:{'Content-Type': 'application/json', 'Accept': 'application/json'}...
self.image.client
config:<tempest.config.TempestConfig instance at 0x36c7cb0>, user:tempest_demouser_4, password:secret, auth_url:https://api.aaptest.cci.blah.com:5000/v2.0/, tenant_name:tempest_test2, auth_version:v1.0, service:image, base_url:None, region:{'compute': 'aaptest-region1', 'network': 'aaptest-region1', 'image': 'aaptest-region1', 'volume': 'aaptest-region1', 'orchestration': 'aaptest-region1', 'object-store': 'aaptest-region1', 'identity': 'aaptest-region1'}, endpoint_url:publicURL, build_interval:10, build_timeout:600
token:None...,
headers:{'Content-Type': 'application/json', 'Accept': 'application/json'}...
self.image.client_v2
config:<tempest.config.TempestConfig instance at 0x36c7cb0>, user:tempest_demouser_4, password:secret, auth_url:https://api.aaptest.cci.blah.com:5000/v2.0/, tenant_name:tempest_test2, auth_version:v1.0, service:image, base_url:None, region:{'compute': 'aaptest-region1', 'network': 'aaptest-region1', 'image': 'aaptest-region1', 'volume': 'aaptest-region1', 'orchestration': 'aaptest-region1', 'object-store': 'aaptest-region1', 'identity': 'aaptest-region1'}, endpoint_url:publicURL, build_interval:10, build_timeout:600
token:None...,
headers:{'Content-Type': 'application/json', 'Accept': 'application/json'}...
self.image.client
config:<tempest.config.TempestConfig instance at 0x36c7cb0>, user:ksadmin, password:AAPcloud123, auth_url:https://api.aaptest.cci.blah.com:5000/v2.0/, tenant_name:admin, auth_version:v1.0, service:image, base_url:None, region:{'compute': 'aaptest-region1', 'network': 'aaptest-region1', 'image': 'aaptest-region1', 'volume': 'aaptest-region1', 'orchestration': 'aaptest-region1', 'object-store': 'aaptest-region1', 'identity': 'aaptest-region1'}, endpoint_url:publicURL, build_interval:10, build_timeout:600
token:None...,
headers:{'Content-Type': 'application/json', 'Accept': 'application/json'}...
self.image.client_v2
config:<tempest.config.TempestConfig instance at 0x36c7cb0>, user:ksadmin, password:AAPcloud123, auth_url:https://api.aaptest.cci.blah.com:5000/v2.0/, tenant_name:admin, auth_version:v1.0, service:image, base_url:None, region:{'compute': 'aaptest-region1', 'network': 'aaptest-region1', 'image': 'aaptest-region1', 'volume': 'aaptest-region1', 'orchestration': 'aaptest-region1', 'object-store': 'aaptest-region1', 'identity': 'aaptest-region1'}, endpoint_url:publicURL, build_interval:10, build_timeout:600
token:None...,
headers:{'Content-Type': 'application/json', 'Accept': 'application/json'}...
self.image.client
config:<tempest.config.TempestConfig instance at 0x36c7cb0>, user:tempest_demouser_2, password:secret, auth_url:https://api.aaptest.cci.blah.com:5000/v2.0/, tenant_name:tempest_test, auth_version:v1.0, service:image, base_url:None, region:{'compute': 'aaptest-region1', 'network': 'aaptest-region1', 'image': 'aaptest-region1', 'volume': 'aaptest-region1', 'orchestration': 'aaptest-region1', 'object-store': 'aaptest-region1', 'identity': 'aaptest-region1'}, endpoint_url:publicURL, build_interval:10, build_timeout:600
token:None...,
headers:{'Content-Type': 'application/json', 'Accept': 'application/json'}...
self.image.client_v2
config:<tempest.config.TempestConfig instance at 0x36c7cb0>, user:tempest_demouser_2, password:secret, auth_url:https://api.aaptest.cci.blah.com:5000/v2.0/, tenant_name:tempest_test, auth_version:v1.0, service:image, base_url:None, region:{'compute': 'aaptest-region1', 'network': 'aaptest-region1', 'image': 'aaptest-region1', 'volume': 'aaptest-region1', 'orchestration': 'aaptest-region1', 'object-store': 'aaptest-region1', 'identity': 'aaptest-region1'}, endpoint_url:publicURL, build_interval:10, build_timeout:600
token:None...,
headers:{'Content-Type': 'application/json', 'Accept': 'application/json'}...

--------------------- >> end captured stdout << ----------------------

======================================================================
FAIL: tempest.api.object_storage.test_object_services.PublicObjectTest.test_access_public_container_object_without_using_creds[gate,smoke]
----------------------------------------------------------------------
_StringException: pythonlogging:'': {{{
2014-10-08 11:41:03,110 Request: POST https://api.aaptest.cci.blah.com:5000/v2.0/tokens
2014-10-08 11:41:04,258 Response Status: 200
2014-10-08 11:41:04,259 Request: PUT https://api.aaptest.cci.blah.com:8080/v1/AUTH_56ba72f5be584b8c9ba83c8a7f64ed1e/TestContainer563626263
2014-10-08 11:41:04,314 Response Status: 411
}}}

Traceback (most recent call last):
  File "/home/ks/tempest_old/tempest/api/object_storage/test_object_services.py", line 285, in setUp
    self.container_client.create_container(self.container_name)
  File "/home/ks/tempest_old/tempest/services/object_storage/container_client.py", line 47, in create_container
    resp, body = self.put(url, body=None, headers=headers)
  File "/home/ks/tempest_old/tempest/common/rest_client.py", line 314, in put
    return self.request('PUT', url, headers, body)
  File "/home/ks/tempest_old/tempest/common/rest_client.py", line 436, in request
    resp, resp_body)
  File "/home/ks/tempest_old/tempest/common/rest_client.py", line 527, in _error_checker
    raise exceptions.RestClientException(str(resp.status))
RestClientException: An unknown exception occurred
Details: 411

-------------------- >> begin captured logging << --------------------
tempest.common.rest_client: INFO: Request: POST https://api.aaptest.cci.blah.com:5000/v2.0/tokens
tempest.common.rest_client: INFO: Response Status: 200
tempest.common.rest_client: INFO: Request: PUT https://api.aaptest.cci.blah.com:8080/v1/AUTH_56ba72f5be584b8c9ba83c8a7f64ed1e/TestContainer563626263
tempest.common.rest_client: INFO: Response Status: 411
--------------------- >> end captured logging << ---------------------

======================================================================
FAIL: tempest.api.object_storage.test_object_services.PublicObjectTest.test_access_public_object_with_another_user_creds[gate,smoke]
----------------------------------------------------------------------
_StringException: pythonlogging:'': {{{
2014-10-08 11:41:04,320 Request: PUT https://api.aaptest.cci.blah.com:8080/v1/AUTH_56ba72f5be584b8c9ba83c8a7f64ed1e/TestContainer615301890
2014-10-08 11:41:04,377 Response Status: 411
}}}

Traceback (most recent call last):
  File "/home/ks/tempest_old/tempest/api/object_storage/test_object_services.py", line 285, in setUp
    self.container_client.create_container(self.container_name)
  File "/home/ks/tempest_old/tempest/services/object_storage/container_client.py", line 47, in create_container
    resp, body = self.put(url, body=None, headers=headers)
  File "/home/ks/tempest_old/tempest/common/rest_client.py", line 314, in put
    return self.request('PUT', url, headers, body)
  File "/home/ks/tempest_old/tempest/common/rest_client.py", line 436, in request
    resp, resp_body)
  File "/home/ks/tempest_old/tempest/common/rest_client.py", line 527, in _error_checker
    raise exceptions.RestClientException(str(resp.status))
RestClientException: An unknown exception occurred
Details: 411

-------------------- >> begin captured logging << --------------------
tempest.common.rest_client: INFO: Request: PUT https://api.aaptest.cci.blah.com:8080/v1/AUTH_56ba72f5be584b8c9ba83c8a7f64ed1e/TestContainer615301890
tempest.common.rest_client: INFO: Response Status: 411
--------------------- >> end captured logging << ---------------------

----------------------------------------------------------------------
Ran 2 tests in 5.382s

FAILED (errors=1, failures=2)

tempest all object storage test failingfailing RestClientException

hello

I am having a issue with running tempest on object storage. it works fine for other openstack components expect for object storage. below is the detials for my tempest.conf for object storage.

[object-storage]
catalog_type = object-store
region = xxxx
container_sync_timeout = 120
container_sync_interval = 120
accounts_quotas_available = True
container_quotas_available = True
operator_role = admin

below is the output from tempest run. i have change the endpoint url so i dont show my public url.

ks@M400005Tempest-API-Testing:~/tempest_old/tempest/Tempest_Automated_Test$ nosetests -v /home/ks/tempest_old/tempest/api/object_storage/test_object_expiry.pyc
ERROR

======================================================================
ERROR: test suite for <class 'tempest.api.object_storage.test_object_expiry.ObjectExpiryTest'>
----------------------------------------------------------------------
Traceback (most recent call last):
  File "/usr/lib/python2.7/dist-packages/nose/suite.py", line 208, in run
    self.setUp()
  File "/usr/lib/python2.7/dist-packages/nose/suite.py", line 291, in setUp
    self.setupContext(ancestor)
  File "/usr/lib/python2.7/dist-packages/nose/suite.py", line 314, in setupContext
    try_run(context, names)
  File "/usr/lib/python2.7/dist-packages/nose/util.py", line 478, in try_run
    return func()
  File "/home/ks/tempest_old/tempest/api/object_storage/test_object_expiry.py", line 33, in setUpClass
    cls.container_client.create_container(cls.container_name)
  File "/home/ks/tempest_old/tempest/services/object_storage/container_client.py", line 47, in create_container
    resp, body = self.put(url, body=None, headers=headers)
  File "/home/ks/tempest_old/tempest/common/rest_client.py", line 314, in put
    return self.request('PUT', url, headers, body)
  File "/home/ks/tempest_old/tempest/common/rest_client.py", line 436, in request
    resp, resp_body)
  File "/home/ks/tempest_old/tempest/common/rest_client.py", line 527, in _error_checker
    raise exceptions.RestClientException(str(resp.status))
RestClientException: An unknown exception occurred
Details: An unknown exception occurred
Details: 411
-------------------- >> begin captured stdout << ---------------------
self.image.client
config:<tempest.config.TempestConfig instance at 0x2e75a70>, user:ksadmin, password:AAPcloud123, auth_url:https://api.aaptest.cci.blah.com:5000/v2.0/, tenant_name:admin, auth_version:v1.0, service:image, base_url:None, region:{'compute': 'aaptest-region1', 'network': 'aaptest-region1', 'image': 'aaptest-region1', 'volume': 'aaptest-region1', 'orchestration': 'aaptest-region1', 'object-store': 'aaptest-region1', 'identity': 'aaptest-region1'}, endpoint_url:publicURL, build_interval:10, build_timeout:600
token:None...,
headers:{'Content-Type': 'application/json', 'Accept': 'application/json'}...
self.image.client_v2
config:<tempest.config.TempestConfig instance at 0x2e75a70>, user:ksadmin, password:AAPcloud123, auth_url:https://api.aaptest.cci.blah.com:5000/v2.0/, tenant_name:admin, auth_version:v1.0, service:image, base_url:None, region:{'compute': 'aaptest-region1', 'network': 'aaptest-region1', 'image': 'aaptest-region1', 'volume': 'aaptest-region1', 'orchestration': 'aaptest-region1', 'object-store': 'aaptest-region1', 'identity': 'aaptest-region1'}, endpoint_url:publicURL, build_interval:10, build_timeout:600
token:None...,
headers:{'Content-Type': 'application/json', 'Accept': 'application/json'}...
self.image.client
config:<tempest.config.TempestConfig instance at 0x2e75a70>, user:tempest_demouser_4, password:secret, auth_url:https://api.aaptest.cci.blah.com:5000/v2.0/, tenant_name:tempest_test2, auth_version:v1.0, service:image, base_url:None, region:{'compute': 'aaptest-region1', 'network': 'aaptest-region1', 'image': 'aaptest-region1', 'volume': 'aaptest-region1', 'orchestration': 'aaptest-region1', 'object-store': 'aaptest-region1', 'identity': 'aaptest-region1'}, endpoint_url:publicURL, build_interval:10, build_timeout:600
token:None...,
headers:{'Content-Type': 'application/json', 'Accept': 'application/json'}...
self.image.client_v2
config:<tempest.config.TempestConfig instance at 0x2e75a70>, user:tempest_demouser_4, password:secret, auth_url:https://api.aaptest.cci.blah.com:5000/v2.0/, tenant_name:tempest_test2, auth_version:v1.0, service:image, base_url:None, region:{'compute': 'aaptest-region1', 'network': 'aaptest-region1', 'image': 'aaptest-region1', 'volume': 'aaptest-region1', 'orchestration': 'aaptest-region1', 'object-store': 'aaptest-region1', 'identity': 'aaptest-region1'}, endpoint_url:publicURL, build_interval:10, build_timeout:600
token:None...,
headers:{'Content-Type': 'application/json', 'Accept': 'application/json'}...
self.image.client
config:<tempest.config.TempestConfig instance at 0x2e75a70>, user:ksadmin, password:AAPcloud123, auth_url:https://api.aaptest.cci.blah.com:5000/v2.0/, tenant_name:admin, auth_version:v1.0, service:image, base_url:None, region:{'compute': 'aaptest-region1', 'network': 'aaptest-region1', 'image': 'aaptest-region1', 'volume': 'aaptest-region1', 'orchestration': 'aaptest-region1', 'object-store': 'aaptest-region1', 'identity': 'aaptest-region1'}, endpoint_url:publicURL, build_interval:10, build_timeout:600
token:None...,
headers:{'Content-Type': 'application/json', 'Accept': 'application/json'}...
self.image.client_v2
config:<tempest.config.TempestConfig instance at 0x2e75a70>, user:ksadmin, password:AAPcloud123, auth_url:https://api.aaptest.cci.blah.com:5000/v2.0/, tenant_name:admin, auth_version:v1.0, service:image, base_url:None, region:{'compute': 'aaptest-region1', 'network': 'aaptest-region1', 'image': 'aaptest-region1', 'volume': 'aaptest-region1', 'orchestration': 'aaptest-region1', 'object-store': 'aaptest-region1', 'identity': 'aaptest-region1'}, endpoint_url:publicURL, build_interval:10, build_timeout:600
token:None...,
headers:{'Content-Type': 'application/json', 'Accept': 'application/json'}...
self.image.client
config:<tempest.config.TempestConfig instance at 0x2e75a70>, user:tempest_demouser_2, password:secret, auth_url:https://api.aaptest.cci.blah.com:5000/v2.0/, tenant_name:tempest_test, auth_version:v1.0, service:image, base_url:None, region:{'compute': 'aaptest-region1', 'network': 'aaptest-region1', 'image': 'aaptest-region1', 'volume': 'aaptest-region1', 'orchestration': 'aaptest-region1', 'object-store': 'aaptest-region1', 'identity': 'aaptest-region1'}, endpoint_url:publicURL, build_interval:10, build_timeout:600
token:None...,
headers:{'Content-Type': 'application/json', 'Accept': 'application/json'}...
self.image.client_v2
config:<tempest.config.TempestConfig instance at 0x2e75a70>, user:tempest_demouser_2, password:secret, auth_url:https://api.aaptest.cci.blah.com:5000/v2.0/, tenant_name:tempest_test, auth_version:v1.0, service:image, base_url:None, region:{'compute': 'aaptest-region1', 'network': 'aaptest-region1', 'image': 'aaptest-region1', 'volume': 'aaptest-region1', 'orchestration': 'aaptest-region1', 'object-store': 'aaptest-region1', 'identity': 'aaptest-region1'}, endpoint_url:publicURL, build_interval:10, build_timeout:600
token:None...,
headers:{'Content-Type': 'application/json', 'Accept': 'application/json'}...

--------------------- >> end captured stdout << ----------------------

----------------------------------------------------------------------
Ran 0 tests in 12.889s

FAILED (errors=1)
ks@M400005Tempest-API-Testing:~/tempest_old/tempest/Tempest_Automated_Test$ nosetests -v /home/ks/tempest_old/tempest/api/object_storage/test_object_services.pyc
ERROR
tempest.api.object_storage.test_object_services.PublicObjectTest.test_access_public_container_object_without_using_creds[gate,smoke] ... FAIL
tempest.api.object_storage.test_object_services.PublicObjectTest.test_access_public_object_with_another_user_creds[gate,smoke] ... FAIL

======================================================================
ERROR: test suite for <class 'tempest.api.object_storage.test_object_services.ObjectTest'>
----------------------------------------------------------------------
Traceback (most recent call last):
  File "/usr/lib/python2.7/dist-packages/nose/suite.py", line 208, in run
    self.setUp()
  File "/usr/lib/python2.7/dist-packages/nose/suite.py", line 291, in setUp
    self.setupContext(ancestor)
  File "/usr/lib/python2.7/dist-packages/nose/suite.py", line 314, in setupContext
    try_run(context, names)
  File "/usr/lib/python2.7/dist-packages/nose/util.py", line 478, in try_run
    return func()
  File "/home/ks/tempest_old/tempest/api/object_storage/test_object_services.py", line 32, in setUpClass
    cls.container_client.create_container(cls.container_name)
  File "/home/ks/tempest_old/tempest/services/object_storage/container_client.py", line 47, in create_container
    resp, body = self.put(url, body=None, headers=headers)
  File "/home/ks/tempest_old/tempest/common/rest_client.py", line 314, in put
    return self.request('PUT', url, headers, body)
  File "/home/ks/tempest_old/tempest/common/rest_client.py", line 436, in request
    resp, resp_body)
  File "/home/ks/tempest_old/tempest/common/rest_client.py", line 527, in _error_checker
    raise exceptions.RestClientException(str(resp.status))
RestClientException: An unknown exception occurred
Details: An unknown exception occurred
Details: 411
-------------------- >> begin captured stdout << ---------------------
self.image.client
config:<tempest.config.TempestConfig instance at 0x36c7cb0>, user:ksadmin, password:AAPcloud123, auth_url:https://api.aaptest.cci.blah.com:5000/v2.0/, tenant_name:admin, auth_version:v1.0, service:image, base_url:None, region:{'compute': 'aaptest-region1', 'network': 'aaptest-region1', 'image': 'aaptest-region1', 'volume': 'aaptest-region1', 'orchestration': 'aaptest-region1', 'object-store': 'aaptest-region1', 'identity': 'aaptest-region1'}, endpoint_url:publicURL, build_interval:10, build_timeout:600
token:None...,
headers:{'Content-Type': 'application/json', 'Accept': 'application/json'}...
self.image.client_v2
config:<tempest.config.TempestConfig instance at 0x36c7cb0>, user:ksadmin, password:AAPcloud123, auth_url:https://api.aaptest.cci.blah.com:5000/v2.0/, tenant_name:admin, auth_version:v1.0, service:image, base_url:None, region:{'compute': 'aaptest-region1', 'network': 'aaptest-region1', 'image': 'aaptest-region1', 'volume': 'aaptest-region1', 'orchestration': 'aaptest-region1', 'object-store': 'aaptest-region1', 'identity': 'aaptest-region1'}, endpoint_url:publicURL, build_interval:10, build_timeout:600
token:None...,
headers:{'Content-Type': 'application/json', 'Accept': 'application/json'}...
self.image.client
config:<tempest.config.TempestConfig instance at 0x36c7cb0>, user:tempest_demouser_4, password:secret, auth_url:https://api.aaptest.cci.blah.com:5000/v2.0/, tenant_name:tempest_test2, auth_version:v1.0, service:image, base_url:None, region:{'compute': 'aaptest-region1', 'network': 'aaptest-region1', 'image': 'aaptest-region1', 'volume': 'aaptest-region1', 'orchestration': 'aaptest-region1', 'object-store': 'aaptest-region1', 'identity': 'aaptest-region1'}, endpoint_url:publicURL, build_interval:10, build_timeout:600
token:None...,
headers:{'Content-Type': 'application/json', 'Accept': 'application/json'}...
self.image.client_v2
config:<tempest.config.TempestConfig instance at 0x36c7cb0>, user:tempest_demouser_4, password:secret, auth_url:https://api.aaptest.cci.blah.com:5000/v2.0/, tenant_name:tempest_test2, auth_version:v1.0, service:image, base_url:None, region:{'compute': 'aaptest-region1', 'network': 'aaptest-region1', 'image': 'aaptest-region1', 'volume': 'aaptest-region1', 'orchestration': 'aaptest-region1', 'object-store': 'aaptest-region1', 'identity': 'aaptest-region1'}, endpoint_url:publicURL, build_interval:10, build_timeout:600
token:None...,
headers:{'Content-Type': 'application/json', 'Accept': 'application/json'}...
self.image.client
config:<tempest.config.TempestConfig instance at 0x36c7cb0>, user:ksadmin, password:AAPcloud123, auth_url:https://api.aaptest.cci.blah.com:5000/v2.0/, tenant_name:admin, auth_version:v1.0, service:image, base_url:None, region:{'compute': 'aaptest-region1', 'network': 'aaptest-region1', 'image': 'aaptest-region1', 'volume': 'aaptest-region1', 'orchestration': 'aaptest-region1', 'object-store': 'aaptest-region1', 'identity': 'aaptest-region1'}, endpoint_url:publicURL, build_interval:10, build_timeout:600
token:None...,
headers:{'Content-Type': 'application/json', 'Accept': 'application/json'}...
self.image.client_v2
config:<tempest.config.TempestConfig instance at 0x36c7cb0>, user:ksadmin, password:AAPcloud123, auth_url:https://api.aaptest.cci.blah.com:5000/v2.0/, tenant_name:admin, auth_version:v1.0, service:image, base_url:None, region:{'compute': 'aaptest-region1', 'network': 'aaptest-region1', 'image': 'aaptest-region1', 'volume': 'aaptest-region1', 'orchestration': 'aaptest-region1', 'object-store': 'aaptest-region1', 'identity': 'aaptest-region1'}, endpoint_url:publicURL, build_interval:10, build_timeout:600
token:None...,
headers:{'Content-Type': 'application/json', 'Accept': 'application/json'}...
self.image.client
config:<tempest.config.TempestConfig instance at 0x36c7cb0>, user:tempest_demouser_2, password:secret, auth_url:https://api.aaptest.cci.blah.com:5000/v2.0/, tenant_name:tempest_test, auth_version:v1.0, service:image, base_url:None, region:{'compute': 'aaptest-region1', 'network': 'aaptest-region1', 'image': 'aaptest-region1', 'volume': 'aaptest-region1', 'orchestration': 'aaptest-region1', 'object-store': 'aaptest-region1', 'identity': 'aaptest-region1'}, endpoint_url:publicURL, build_interval:10, build_timeout:600
token:None...,
headers:{'Content-Type': 'application/json', 'Accept': 'application/json'}...
self.image.client_v2
config:<tempest.config.TempestConfig instance at 0x36c7cb0>, user:tempest_demouser_2, password:secret, auth_url:https://api.aaptest.cci.blah.com:5000/v2.0/, tenant_name:tempest_test, auth_version:v1.0, service:image, base_url:None, region:{'compute': 'aaptest-region1', 'network': 'aaptest-region1', 'image': 'aaptest-region1', 'volume': 'aaptest-region1', 'orchestration': 'aaptest-region1', 'object-store': 'aaptest-region1', 'identity': 'aaptest-region1'}, endpoint_url:publicURL, build_interval:10, build_timeout:600
token:None...,
headers:{'Content-Type': 'application/json', 'Accept': 'application/json'}...

--------------------- >> end captured stdout << ----------------------

======================================================================
FAIL: tempest.api.object_storage.test_object_services.PublicObjectTest.test_access_public_container_object_without_using_creds[gate,smoke]
----------------------------------------------------------------------
_StringException: pythonlogging:'': {{{
2014-10-08 11:41:03,110 Request: POST https://api.aaptest.cci.blah.com:5000/v2.0/tokens
2014-10-08 11:41:04,258 Response Status: 200
2014-10-08 11:41:04,259 Request: PUT https://api.aaptest.cci.blah.com:8080/v1/AUTH_56ba72f5be584b8c9ba83c8a7f64ed1e/TestContainer563626263
2014-10-08 11:41:04,314 Response Status: 411
}}}

Traceback (most recent call last):
  File "/home/ks/tempest_old/tempest/api/object_storage/test_object_services.py", line 285, in setUp
    self.container_client.create_container(self.container_name)
  File "/home/ks/tempest_old/tempest/services/object_storage/container_client.py", line 47, in create_container
    resp, body = self.put(url, body=None, headers=headers)
  File "/home/ks/tempest_old/tempest/common/rest_client.py", line 314, in put
    return self.request('PUT', url, headers, body)
  File "/home/ks/tempest_old/tempest/common/rest_client.py", line 436, in request
    resp, resp_body)
  File "/home/ks/tempest_old/tempest/common/rest_client.py", line 527, in _error_checker
    raise exceptions.RestClientException(str(resp.status))
RestClientException: An unknown exception occurred
Details: 411

-------------------- >> begin captured logging << --------------------
tempest.common.rest_client: INFO: Request: POST https://api.aaptest.cci.blah.com:5000/v2.0/tokens
tempest.common.rest_client: INFO: Response Status: 200
tempest.common.rest_client: INFO: Request: PUT https://api.aaptest.cci.blah.com:8080/v1/AUTH_56ba72f5be584b8c9ba83c8a7f64ed1e/TestContainer563626263
tempest.common.rest_client: INFO: Response Status: 411
--------------------- >> end captured logging << ---------------------

======================================================================
FAIL: tempest.api.object_storage.test_object_services.PublicObjectTest.test_access_public_object_with_another_user_creds[gate,smoke]
----------------------------------------------------------------------
_StringException: pythonlogging:'': {{{
2014-10-08 11:41:04,320 Request: PUT https://api.aaptest.cci.blah.com:8080/v1/AUTH_56ba72f5be584b8c9ba83c8a7f64ed1e/TestContainer615301890
2014-10-08 11:41:04,377 Response Status: 411
}}}

Traceback (most recent call last):
  File "/home/ks/tempest_old/tempest/api/object_storage/test_object_services.py", line 285, in setUp
    self.container_client.create_container(self.container_name)
  File "/home/ks/tempest_old/tempest/services/object_storage/container_client.py", line 47, in create_container
    resp, body = self.put(url, body=None, headers=headers)
  File "/home/ks/tempest_old/tempest/common/rest_client.py", line 314, in put
    return self.request('PUT', url, headers, body)
  File "/home/ks/tempest_old/tempest/common/rest_client.py", line 436, in request
    resp, resp_body)
  File "/home/ks/tempest_old/tempest/common/rest_client.py", line 527, in _error_checker
    raise exceptions.RestClientException(str(resp.status))
RestClientException: An unknown exception occurred
Details: 411

-------------------- >> begin captured logging << --------------------
tempest.common.rest_client: INFO: Request: PUT https://api.aaptest.cci.blah.com:8080/v1/AUTH_56ba72f5be584b8c9ba83c8a7f64ed1e/TestContainer615301890
tempest.common.rest_client: INFO: Response Status: 411
--------------------- >> end captured logging << ---------------------

----------------------------------------------------------------------
Ran 2 tests in 5.382s

FAILED (errors=1, failures=2)